BDBM100059 7-pyrido[1,2-a]benzimidazolecarbonitrile::MLS000729087::SMR000307365::cid_1504955::pyrido[1,2-a]benzimidazole-7-carbonitrile
SMILES N#Cc1ccc2c(c1)nc1ccccn21
InChI Key InChIKey=FIYNZQYMGOBOGI-UHFFFAOYSA-N
Data  1 EC50
  Tab Delimited (TSV)   2D SDfile   Computed 3D by Vconf -m prep SDfile
Find this compound or compounds like it in BindingDB:
Activity Spreadsheet -- Enzyme Inhibition Constant Data from BindingDB
Found 1 hit for monomerid = 100059
TargetKallikrein-7(Homo sapiens (Human))
The Scripps Research Institute Molecular Screening Center
Curated by PubChem BioAssay
LigandPNGBDBM100059(7-pyrido[1,2-a]benzimidazolecarbonitrile | MLS0007...)
Affinity DataEC50: >6.96E+4nM
In DepthDetails PCBioAssay