BDBM100121 MLS000936986::N-(3,4-dimethoxyphenyl)-5-(2-furanyl)-3-isoxazolecarboxamide::N-(3,4-dimethoxyphenyl)-5-(2-furyl)isoxazole-3-carboxamide::N-(3,4-dimethoxyphenyl)-5-(furan-2-yl)-1,2-oxazole-3-carboxamide::SMR000621676::cid_15998745
SMILES COc1ccc(NC(=O)c2cc(on2)-c2ccco2)cc1OC
InChI Key InChIKey=GZXYZYKWNHSXBN-UHFFFAOYSA-N
Data  1 EC50
  Tab Delimited (TSV)   2D SDfile   Computed 3D by Vconf -m prep SDfile
Find this compound or compounds like it in BindingDB:
Activity Spreadsheet -- Enzyme Inhibition Constant Data from BindingDB
Found 1 hit for monomerid = 100121
TargetKallikrein-7(Homo sapiens (Human))
The Scripps Research Institute Molecular Screening Center
Curated by PubChem BioAssay
LigandPNGBDBM100121(MLS000936986 | N-(3,4-dimethoxyphenyl)-5-(2-furany...)
Affinity DataEC50:  1.31E+4nM
In DepthDetails PCBioAssay