BDBM100203 MLS000565348::SMR000152579::[3-(diethylamino)-1-isoindolylidene]-diethylammonium;perchlorate::[3-(diethylamino)isoindol-1-ylidene]-diethyl-ammonium;perchlorate::[3-(diethylamino)isoindol-1-ylidene]-diethyl-azanium;perchlorate::[3-(diethylamino)isoindol-1-ylidene]-diethylazanium;perchlorate::cid_9552001
SMILES [#6]-[#6]-[#7](-[#6]-[#6])-[#6]-1=[#7]\[#6](-c2ccccc-12)=[#7+](/[#6]-[#6])-[#6]-[#6]
InChI Key InChIKey=RBHZGVFTWLUADV-UHFFFAOYSA-N
Data  2 IC50
  Tab Delimited (TSV)   2D SDfile   Computed 3D by Vconf -m prep SDfile
Find this compound or compounds like it in BindingDB:
Activity Spreadsheet -- Enzyme Inhibition Constant Data from BindingDB
Found 2 hits for monomerid = 100203
TargetTegument protein VP16(Human herpesvirus 1 (strain 17) (HHV-1) (Human her...)
The Scripps Research Institute Molecular Screening Center
Curated by PubChem BioAssay
LigandPNGBDBM100203(MLS000565348 | SMR000152579 | [3-(diethylamino)-1-...)
Affinity DataIC50:  8.54E+4nM. Assay description: Source (MLPCN Center Name): The Scripps Research Institute Molecular Screening Center Affiliation: The Scripps Research Institute, TSRI Assay Provide...
In DepthDetails PCBioAssay
TargetCOUP transcription factor 2(Homo sapiens (Human))
The Scripps Research Institute Molecular Screening Center
Curated by PubChem BioAssay
LigandPNGBDBM100203(MLS000565348 | SMR000152579 | [3-(diethylamino)-1-...)
Affinity DataIC50:  1.40E+4nM
In DepthDetails PCBioAssay