BDBM100211 2-[[5-(3-chloranyl-1-benzothiophen-2-yl)-1,3,4-oxadiazol-2-yl]sulfanyl]ethanenitrile::2-[[5-(3-chloro-1-benzothiophen-2-yl)-1,3,4-oxadiazol-2-yl]sulfanyl]acetonitrile::2-[[5-(3-chloro-1-benzothiophen-2-yl)-1,3,4-oxadiazol-2-yl]thio]acetonitrile::2-[[5-(3-chlorobenzothiophen-2-yl)-1,3,4-oxadiazol-2-yl]thio]acetonitrile::MLS000388965::SMR000255139::cid_2514699
SMILES Clc1c(sc2ccccc12)-c1nnc(SCC#N)o1
InChI Key InChIKey=SCAPGNQQZIVBLA-UHFFFAOYSA-N
Data  2 IC50
  Tab Delimited (TSV)   2D SDfile   Computed 3D by Vconf -m prep SDfile
Find this compound or compounds like it in BindingDB:
Activity Spreadsheet -- Enzyme Inhibition Constant Data from BindingDB
Found 2 hits for monomerid = 100211
TargetTegument protein VP16(Human herpesvirus 1 (strain 17) (HHV-1) (Human her...)
The Scripps Research Institute Molecular Screening Center
Curated by PubChem BioAssay
LigandPNGBDBM100211(2-[[5-(3-chloranyl-1-benzothiophen-2-yl)-1,3,4-oxa...)
Affinity DataIC50:  8.59E+4nM. Assay description: Source (MLPCN Center Name): The Scripps Research Institute Molecular Screening Center Affiliation: The Scripps Research Institute, TSRI Assay Provide...
In DepthDetails PCBioAssay
TargetCOUP transcription factor 2(Homo sapiens (Human))
The Scripps Research Institute Molecular Screening Center
Curated by PubChem BioAssay
LigandPNGBDBM100211(2-[[5-(3-chloranyl-1-benzothiophen-2-yl)-1,3,4-oxa...)
Affinity DataIC50:  1.20E+4nM
In DepthDetails PCBioAssay