BDBM100215 1-[1-({5-[(quinolin-6-yloxy)methyl]isoxazol-3-yl}carbonyl)piperidin-4-yl]propan-1-ol::MLS000734613::SMR000317846::[4-(1-hydroxypropyl)-1-piperidinyl]-[5-(6-quinolinyloxymethyl)-3-isoxazolyl]methanone::[4-(1-hydroxypropyl)piperidin-1-yl]-[5-(quinolin-6-yloxymethyl)-1,2-oxazol-3-yl]methanone::[4-(1-hydroxypropyl)piperidino]-[5-(6-quinolyloxymethyl)isoxazol-3-yl]methanone::[4-(1-oxidanylpropyl)piperidin-1-yl]-[5-(quinolin-6-yloxymethyl)-1,2-oxazol-3-yl]methanone::cid_16187732
SMILES CCC(O)C1CCN(CC1)C(=O)c1cc(COc2ccc3ncccc3c2)on1
InChI Key InChIKey=ZSUJPGVJLWGAQR-UHFFFAOYSA-N
Data  2 IC50
  Tab Delimited (TSV)   2D SDfile   Computed 3D by Vconf -m prep SDfile
Find this compound or compounds like it in BindingDB:
Activity Spreadsheet -- Enzyme Inhibition Constant Data from BindingDB
Found 2 hits for monomerid = 100215
TargetTegument protein VP16(Human herpesvirus 1 (strain 17) (HHV-1) (Human her...)
The Scripps Research Institute Molecular Screening Center
Curated by PubChem BioAssay
LigandPNGBDBM100215(1-[1-({5-[(quinolin-6-yloxy)methyl]isoxazol-3-yl}c...)
Affinity DataIC50:  8.54E+4nM. Assay description: Source (MLPCN Center Name): The Scripps Research Institute Molecular Screening Center Affiliation: The Scripps Research Institute, TSRI Assay Provide...
In DepthDetails PCBioAssay
TargetCOUP transcription factor 2(Homo sapiens (Human))
The Scripps Research Institute Molecular Screening Center
Curated by PubChem BioAssay
LigandPNGBDBM100215(1-[1-({5-[(quinolin-6-yloxy)methyl]isoxazol-3-yl}c...)
Affinity DataIC50:  4.46E+3nM
In DepthDetails PCBioAssay