BDBM100220 (2-ethyl-1-piperidinyl)-[5-(6-quinolinyloxymethyl)-3-isoxazolyl]methanone::(2-ethylpiperidin-1-yl)-[5-(quinolin-6-yloxymethyl)-1,2-oxazol-3-yl]methanone::(2-ethylpiperidino)-[5-(6-quinolyloxymethyl)isoxazol-3-yl]methanone::6-({3-[(2-ethylpiperidin-1-yl)carbonyl]isoxazol-5-yl}methoxy)quinoline::MLS000732313::SMR000315248::cid_16190915
SMILES CCC1CCCCN1C(=O)c1cc(COc2ccc3ncccc3c2)on1
InChI Key InChIKey=MQXBRAOUPWNEIL-UHFFFAOYSA-N
Data  2 IC50
  Tab Delimited (TSV)   2D SDfile   Computed 3D by Vconf -m prep SDfile
Find this compound or compounds like it in BindingDB:
Activity Spreadsheet -- Enzyme Inhibition Constant Data from BindingDB
Found 2 hits for monomerid = 100220
TargetTegument protein VP16(Human herpesvirus 1 (strain 17) (HHV-1) (Human her...)
The Scripps Research Institute Molecular Screening Center
Curated by PubChem BioAssay
LigandPNGBDBM100220((2-ethyl-1-piperidinyl)-[5-(6-quinolinyloxymethyl)...)
Affinity DataIC50:  8.54E+4nM. Assay description: Source (MLPCN Center Name): The Scripps Research Institute Molecular Screening Center Affiliation: The Scripps Research Institute, TSRI Assay Provide...
In DepthDetails PCBioAssay
TargetCOUP transcription factor 2(Homo sapiens (Human))
The Scripps Research Institute Molecular Screening Center
Curated by PubChem BioAssay
LigandPNGBDBM100220((2-ethyl-1-piperidinyl)-[5-(6-quinolinyloxymethyl)...)
Affinity DataIC50:  4.58E+3nM
In DepthDetails PCBioAssay