BDBM10031 5-[3-(1H-imidazol-1-yl)propyl]-7,8-dihydroquinoline::5-[3-(Imidazol-1-yl)propyl]-7,8-dihydroquinoline::CHEMBL53290::dihydroquinoline 50
SMILES C(CC1=CCCc2ncccc12)Cn1ccnc1
InChI Key InChIKey=JHKBLBMCCJQROB-UHFFFAOYSA-N
Data  3 IC50
  Tab Delimited (TSV)   2D SDfile   Computed 3D by Vconf -m prep SDfile
Find this compound or compounds like it in BindingDB:
Activity Spreadsheet -- Enzyme Inhibition Constant Data from BindingDB
Found 3 hits for monomerid = 10031
TargetAromatase(Homo sapiens (Human))
Universitat Des Saarlandes
LigandPNGBDBM10031(5-[3-(1H-imidazol-1-yl)propyl]-7,8-dihydroquinolin...)
Affinity DataIC50:  220nMpH: 7.4 T: 2°C. Assay description: The enzyme activity was assayed by measuring the 3H-labeled H2O formed from [1beta,2beta-3H]testosterone during aromatization. After incubation, the ...
In DepthDetails ArticlePubMed
TargetAromatase(Homo sapiens (Human))
Universitat Des Saarlandes
LigandPNGBDBM10031(5-[3-(1H-imidazol-1-yl)propyl]-7,8-dihydroquinolin...)
Affinity DataIC50:  220nM. Assay description: Inhibition of human aromatase-mediated conversion of [1beta3H]androstenedione to estrone by liquid scintillation counting in presence of NADPH
In DepthDetails ArticlePubMed
TargetThromboxane-A synthase(Homo sapiens (Human))
Universitat Des Saarlandes
LigandPNGBDBM10031(5-[3-(1H-imidazol-1-yl)propyl]-7,8-dihydroquinolin...)
Affinity DataIC50:  680nM. Assay description: Thromboxane A2 synthase activity was assayed by measuring the fragmentation of prostaglandin H2 to form 12-hydroxy-5, 8,10-heptadecatrienoic acid and...
In DepthDetails ArticlePubMed