BDBM100355 US10383835, Compound 3b::US11123311, Compound 3b::US8501783, 1155
SMILES CCCN1CCC(CC1)NC(=O)NC12CC3CC(CC(C3)C1)C2
InChI Key InChIKey=OYDLKUZQSIKGSE-UHFFFAOYSA-N
Data  3 IC50
  Tab Delimited (TSV)   2D SDfile   Computed 3D by Vconf -m prep SDfile
Find this compound or compounds like it in BindingDB:
Activity Spreadsheet -- Enzyme Inhibition Constant Data from BindingDB
Found 3 hits for monomerid = 100355
TargetEpoxide hydrolase 1(Homo sapiens (Human))
The Regents Of The University Of California
US Patent
LigandPNGBDBM100355(US10383835, Compound 3b | US11123311, Compound 3b ...)
Affinity DataIC50:  809nM. Assay description: Inhibition assay of human soluble epoxide hydrolases.
In DepthDetails US Patent
TargetBifunctional epoxide hydrolase 2(Homo sapiens (Human))
The Regents Of The University Of California
US Patent
LigandPNGBDBM100355(US10383835, Compound 3b | US11123311, Compound 3b ...)
Affinity DataIC50:  810nM. Assay description: Any of a number of standard assays for determining epoxide hydrolase activity can be used to determine inhibition of sEH. For example, suitable assay...
In DepthDetails US Patent
TargetEpoxide hydrolase 1(Homo sapiens (Human))
The Regents Of The University Of California
US Patent
LigandPNGBDBM100355(US10383835, Compound 3b | US11123311, Compound 3b ...)
Affinity DataIC50:  810nM. Assay description: The enzyme also can be detected based on the binding of specific ligands to the catalytic site which either immobilize the enzyme or label it with a ...
In DepthDetails US Patent