BDBM100357 US10383835, Compound 3d::US11123311, Compound 3d::US8501783, 1158
SMILES O=C(NC1CCN(Cc2ccccc2)CC1)NC12CC3CC(CC(C3)C1)C2
InChI Key InChIKey=SZCGIFNKYJVHTL-UHFFFAOYSA-N
Data  3 IC50
  Tab Delimited (TSV)   2D SDfile   Computed 3D by Vconf -m prep SDfile
Find this compound or compounds like it in BindingDB:
Activity Spreadsheet -- Enzyme Inhibition Constant Data from BindingDB
Found 3 hits for monomerid = 100357
TargetEpoxide hydrolase 1(Homo sapiens (Human))
The Regents Of The University Of California
US Patent
LigandPNGBDBM100357(US10383835, Compound 3d | US11123311, Compound 3d ...)
Affinity DataIC50:  8.40nM. Assay description: Inhibition assay of human soluble epoxide hydrolases.
In DepthDetails US Patent
TargetBifunctional epoxide hydrolase 2(Homo sapiens (Human))
The Regents Of The University Of California
US Patent
LigandPNGBDBM100357(US10383835, Compound 3d | US11123311, Compound 3d ...)
Affinity DataIC50:  10nM. Assay description: Any of a number of standard assays for determining epoxide hydrolase activity can be used to determine inhibition of sEH. For example, suitable assay...
In DepthDetails US Patent
TargetEpoxide hydrolase 1(Homo sapiens (Human))
The Regents Of The University Of California
US Patent
LigandPNGBDBM100357(US10383835, Compound 3d | US11123311, Compound 3d ...)
Affinity DataIC50:  10nM. Assay description: The enzyme also can be detected based on the binding of specific ligands to the catalytic site which either immobilize the enzyme or label it with a ...
In DepthDetails US Patent