BDBM100376 US8501783, 1205
SMILES COC(=O)CCC(=O)N1CCC(CC1)NC(=O)NC12CC3CC(CC(C3)C1)C2
InChI Key InChIKey=QHDSXIUQMDHLCI-UHFFFAOYSA-N
Data  1 IC50
  Tab Delimited (TSV)   2D SDfile   Computed 3D by Vconf -m prep SDfile
Find this compound or compounds like it in BindingDB:
Activity Spreadsheet -- Enzyme Inhibition Constant Data from BindingDB
Found 1 hit for monomerid = 100376
TargetEpoxide hydrolase 1(Homo sapiens (Human))
The Regents Of The University Of California
US Patent
LigandPNGBDBM100376(US8501783, 1205)
Affinity DataIC50:  9nM. Assay description: Inhibition assay of human soluble epoxide hydrolases.
In DepthDetails US Patent