BDBM10038 1-[2-(1-benzothiophen-4-yl)ethyl]-1H-imidazole::1-[2-(Benzo[b]thiophen-4-yl)ethyl]-1H-imidazole::Benzo[b]thiophene 32::CHEMBL460382
SMILES C(Cn1ccnc1)c1cccc2sccc12
InChI Key InChIKey=ZEWHOUCPWZPPGK-UHFFFAOYSA-N
Data  3 IC50
  Tab Delimited (TSV)   2D SDfile   Computed 3D by Vconf -m prep SDfile
Find this compound or compounds like it in BindingDB:
Activity Spreadsheet -- Enzyme Inhibition Constant Data from BindingDB
Found 3 hits for monomerid = 10038
TargetAromatase(Homo sapiens (Human))
Universitat Des Saarlandes
LigandPNGBDBM10038(1-[2-(1-benzothiophen-4-yl)ethyl]-1H-imidazole | 1...)
Affinity DataIC50:  3.56E+3nMpH: 7.4 T: 2°C. Assay description: The enzyme activity was assayed by measuring the 3H-labeled H2O formed from [1beta,2beta-3H]testosterone during aromatization. After incubation, the ...
In DepthDetails ArticlePubMed
TargetAromatase(Homo sapiens (Human))
Universitat Des Saarlandes
LigandPNGBDBM10038(1-[2-(1-benzothiophen-4-yl)ethyl]-1H-imidazole | 1...)
Affinity DataIC50:  3.56E+3nM. Assay description: Inhibition of human aromatase-mediated conversion of [1beta3H]androstenedione to estrone by liquid scintillation counting in presence of NADPH
In DepthDetails ArticlePubMed
TargetThromboxane-A synthase(Homo sapiens (Human))
Universitat Des Saarlandes
LigandPNGBDBM10038(1-[2-(1-benzothiophen-4-yl)ethyl]-1H-imidazole | 1...)
Affinity DataIC50:  5.30E+3nM. Assay description: Thromboxane A2 synthase activity was assayed by measuring the fragmentation of prostaglandin H2 to form 12-hydroxy-5, 8,10-heptadecatrienoic acid and...
In DepthDetails ArticlePubMed