BDBM100397 US8501783, 1550
SMILES CCCCCCCCCCCCNC(=O)NC1CCNCC1
InChI Key InChIKey=DBMXBJAHSAAQLA-UHFFFAOYSA-N
Data  1 IC50
  Tab Delimited (TSV)   2D SDfile   Computed 3D by Vconf -m prep SDfile
Find this compound or compounds like it in BindingDB:
Activity Spreadsheet -- Enzyme Inhibition Constant Data from BindingDB
Found 1 hit for monomerid = 100397
TargetEpoxide hydrolase 1(Homo sapiens (Human))
The Regents Of The University Of California
US Patent
LigandPNGBDBM100397(US8501783, 1550)
Affinity DataIC50:  42.5nM. Assay description: Inhibition assay of human soluble epoxide hydrolases.
In DepthDetails US Patent