BDBM10050 (2R,15S)-2-(2-methoxyethyl)-15-methyltetracyclo[8.7.0.0^{2,7}.0^{11,15}]heptadeca-1(17),6-diene-5,14-dione::19-Heteromethyl-Substituted Androstenedione Analog 39::3,17-Dioxo-19-(methoxymethyl)androsta-4,9(11)-diene
SMILES COCC[C@]12CCC(=O)C=C1CCC1C3CCC(=O)[C@@]3(C)CC=C21
InChI Key InChIKey=SQXJYNCVTMWQFT-ZHAWHOEGSA-N
Data  1 IC50
  Tab Delimited (TSV)   2D SDfile   Computed 3D by Vconf -m prep SDfile
Find this compound or compounds like it in BindingDB:
Activity Spreadsheet -- Enzyme Inhibition Constant Data from BindingDB
Found 1 hit for monomerid = 10050
TargetAromatase(Homo sapiens (Human))
Centre De Recherche De Roussel Uclaf
LigandPNGBDBM10050((2R,15S)-2-(2-methoxyethyl)-15-methyltetracyclo[8....)
Affinity DataIC50:  1.00E+4nMpH: 7.2 T: 2°C. Assay description: The enzyme activity was assayed by measuring the formation of tritiated water from [1beta, 2beta-3H ]androstenedione in the presence of increasing co...
Ligand InfoPC cidPC sid
In DepthDetails ArticlePubMed