BDBM100818 US8507533, 125
SMILES CCCC(Oc1ccc(cc1)-n1cc2cccc(C)c2n1)c1ccc(cc1)C(=O)NCCC(O)=O
InChI Key InChIKey=VLJVNIRYGAOFEL-UHFFFAOYSA-N
Data  1 KI
  Tab Delimited (TSV)   2D SDfile   Computed 3D by Vconf -m prep SDfile
Find this compound or compounds like it in BindingDB:
Activity Spreadsheet -- Enzyme Inhibition Constant Data from BindingDB
Found 1 hit for monomerid = 100818
TargetPro-glucagon(Homo sapiens (Human))
Pfizer
US Patent
LigandPNGBDBM100818(US8507533, 125)
Affinity DataKi:  98.2nMpH: 7.4Assay Description:The Glucagon SPA assay is used to determine the ability of test compounds to block the binding of glucagon-cex to the glucagon receptors.
In DepthDetails US Patent