BDBM100826 US8507533, 133
SMILES CCCC(Oc1ccc(nc1)-n1cc(cn1)-c1ccccc1)c1ccc(cc1)C(=O)NCCC(O)=O
InChI Key InChIKey=GOBRXBXKQFYBDM-UHFFFAOYSA-N
Data  1 KI
  Tab Delimited (TSV)   2D SDfile   Computed 3D by Vconf -m prep SDfile
Find this compound or compounds like it in BindingDB:
Activity Spreadsheet -- Enzyme Inhibition Constant Data from BindingDB
Found 1 hit for monomerid = 100826
TargetPro-glucagon(Homo sapiens (Human))
Pfizer
US Patent
LigandPNGBDBM100826(US8507533, 133)
Affinity DataKi:  58nMpH: 7.4Assay Description:The Glucagon SPA assay is used to determine the ability of test compounds to block the binding of glucagon-cex to the glucagon receptors.
In DepthDetails US Patent