BDBM100893 US8507510, 1.31
SMILES CCOC(=O)N=S(C)(=O)c1ccc(Nc2ncc(Br)c(N[C@H](C)C(C)(C)O)n2)cc1
InChI Key InChIKey=DLNVXQGIVOPKFV-KTDAUSLXSA-N
Data  3 IC50
  Tab Delimited (TSV)   2D SDfile   Computed 3D by Vconf -m prep SDfile
Find this compound or compounds like it in BindingDB:
Activity Spreadsheet -- Enzyme Inhibition Constant Data from BindingDB
Found 3 hits for monomerid = 100893
TargetCyclin-dependent kinase 2(Homo sapiens (Human))
Bayer Intellectual Property
US Patent
LigandPNGBDBM100893(US8507510, 1.31)
Affinity DataIC50:  9nM. Assay description: Kinase assay using either CDK1, CDK2 or VEGFR-2.
In DepthDetails US Patent
TargetVascular endothelial growth factor receptor 2(Homo sapiens (Human))
Bayer Intellectual Property
US Patent
LigandPNGBDBM100893(US8507510, 1.31)
Affinity DataIC50:  140nM. Assay description: Kinase assay using either CDK1, CDK2 or VEGFR-2.
In DepthDetails US Patent
TargetCyclin-dependent kinase 1(Homo sapiens (Human))
Bayer Intellectual Property
US Patent
LigandPNGBDBM100893(US8507510, 1.31)
Affinity DataIC50:  27nM. Assay description: Kinase assay using either CDK1, CDK2 or VEGFR-2.
In DepthDetails US Patent