BDBM100959 US8524909, 41
SMILES CSc1cc(cc(c1C(=O)N[C@H]1COCC[C@@H]1N1CCCC1)C(F)(F)F)C(F)(F)F
InChI Key InChIKey=WOPQJHDAGPOSAD-KBPBESRZSA-N
Data  1 IC50
  Tab Delimited (TSV)   2D SDfile   Computed 3D by Vconf -m prep SDfile
Find this compound or compounds like it in BindingDB:
Activity Spreadsheet -- Enzyme Inhibition Constant Data from BindingDB
Found 1 hit for monomerid = 100959
TargetSodium- and chloride-dependent glycine transporter 1(Bos taurus (Bovine))
Hoffmann-La Roche
US Patent
LigandPNGBDBM100959(US8524909, 41)
Affinity DataIC50:  44.7nMT: 2°C. Assay description: Glycine uptake inhibition assay.
In DepthDetails US Patent