BDBM10097 (3Z)-5-fluoro-4-[(3S)-3-hydroxybut-1-yn-1-yl]-3-[(3-methoxy-1H-pyrrol-2-yl)methylidene]-2,3-dihydro-1H-indol-2-one::4-alkynyl oxindole 7c
SMILES COc1cc[nH]c1\C=C1/C(=O)Nc2ccc(F)c(C#C[C@H](C)O)c12
InChI Key InChIKey=DJEJXDSNSASKPZ-JMZICWNOSA-N
Data  1 IC50
  Tab Delimited (TSV)   2D SDfile   Computed 3D by Vconf -m prep SDfile
Find this compound or compounds like it in BindingDB:
Activity Spreadsheet -- Enzyme Inhibition Constant Data from BindingDB
Found 1 hit for monomerid = 10097
TargetCyclin-dependent kinase 2/G1/S-specific cyclin-E1(Homo sapiens (Human))
Hoffmann-La Roche
LigandPNGBDBM10097((3Z)-5-fluoro-4-[(3S)-3-hydroxybut-1-yn-1-yl]-3-[(...)
Affinity DataIC50:  26nMpH: 7.5 T: 2°C. Assay description: Kinase assays were performed using a recombinant human cyclin E-CDK2 complex. The enzyme was assayed with substrate in the presence of 1uM ATP/[gamma...
In DepthDetails ArticlePubMed