BDBM10107 (3Z)-4-[(3R,4R)-3-(ethylamino)-4-hydroxypent-1-yn-1-yl]-5-fluoro-3-[(3-methoxy-1H-pyrrol-2-yl)methylidene]-2,3-dihydro-1H-indol-2-one::4-alkynyl oxindole 7m
SMILES CCN[C@H](C#Cc1c2\C(=C\c3[nH]ccc3OC)C(=O)Nc2ccc1F)[C@@H](C)O
InChI Key InChIKey=XSAPHSITEDFKJO-GAMIKGPZSA-N
Data  1 IC50
  Tab Delimited (TSV)   2D SDfile   Computed 3D by Vconf -m prep SDfile
Find this compound or compounds like it in BindingDB:
Activity Spreadsheet -- Enzyme Inhibition Constant Data from BindingDB
Found 1 hit for monomerid = 10107
TargetCyclin-dependent kinase 2/G1/S-specific cyclin-E1(Homo sapiens (Human))
Hoffmann-La Roche
LigandPNGBDBM10107((3Z)-4-[(3R,4R)-3-(ethylamino)-4-hydroxypent-1-yn-...)
Affinity DataIC50:  18nMpH: 7.5 T: 2°C. Assay description: Kinase assays were performed using a recombinant human cyclin E-CDK2 complex. The enzyme was assayed with substrate in the presence of 1uM ATP/[gamma...
In DepthDetails ArticlePubMed