BDBM101124 US10189794, Compound I-104::US10618902, Compound I-104::US10774052, Compound I-104::US9695132, I-104
SMILES COc1cc(OC)c(Cl)c(c1)N1Cc2cnc(Nc3ccccc3NC(=O)C=C)nc2N(CC(F)F)C1=O
InChI Key InChIKey=CXDBMIJORVIMIH-UHFFFAOYSA-N
Data  4 IC50
  Tab Delimited (TSV)   2D SDfile   Computed 3D by Vconf -m prep SDfile
Find this compound or compounds like it in BindingDB:
Activity Spreadsheet -- Enzyme Inhibition Constant Data from BindingDB
Found 4 hits for monomerid = 101124
TargetFibroblast growth factor receptor 4(Homo sapiens (Human))
Celgene Car
US Patent
LigandPNGBDBM101124(US10189794, Compound I-104 | US10618902, Compound ...)
Affinity DataIC50: <100nMpH: 7.5Assay Description:Omnia Assay Protocol for Potency Assessment Against FGFR 4 Enzyme. a) [FGFR4-WT]=10 nM, [ATP]=300 uM, [Y10-Sox]=10 uM (ATP KMapp 300 uM): A 10x stock...
In DepthDetails US Patent
TargetFibroblast growth factor receptor 4(Homo sapiens (Human))
Celgene Car
US Patent
LigandPNGBDBM101124(US10189794, Compound I-104 | US10618902, Compound ...)
Affinity DataIC50: <100nM. Assay description: For MDA-MB-453 cells signaling, cells were grown in 96-well poly-D-lysine plates (BD Bioscience, San Jose, Calif.) to 90% confluence, and were then i...
In DepthDetails US Patent
TargetFibroblast growth factor receptor 4(Homo sapiens (Human))
Celgene Car
US Patent
LigandPNGBDBM101124(US10189794, Compound I-104 | US10618902, Compound ...)
Affinity DataIC50: <500nM. Assay description: A 10× stock solution of FGFR4-WT (PR4380C or P3054), (from Invitrogen, Carlsbad, Calif.) corresponding to method a in Table 10, was prepared as descr...
In DepthDetails US Patent
TargetFibroblast growth factor receptor 4(Homo sapiens (Human))
Celgene Car
US Patent
LigandPNGBDBM101124(US10189794, Compound I-104 | US10618902, Compound ...)
Affinity DataIC50: <100nM. Assay description: A 10× stock solution of FGFR4-WT (PR4380C), (from Invitrogen, Carlsbad, Calif.) corresponding to method a in Table 7, was prepared as described below...
In DepthDetails US Patent