BDBM101376 US9695151, 42
SMILES CCS(=O)(=O)N1CC(C1)Nc1cncc(c1)N1[C@@H](C)c2cc(Cl)ccc2C1=O
InChI Key InChIKey=FDILLSVSLOUAEN-LBPRGKRZSA-N
Data  2 EC50
  Tab Delimited (TSV)   2D SDfile   Computed 3D by Vconf -m prep SDfile
Find this compound or compounds like it in BindingDB:
Activity Spreadsheet -- Enzyme Inhibition Constant Data from BindingDB
Found 2 hits for monomerid = 101376
TargetCytochrome P450 11B1, mitochondrial(Homo sapiens (Human))
Hoffmann-La Roche
US Patent
LigandPNGBDBM101376(US9695151, 42)
Affinity DataEC50:  1.07E+3nMT: 2°C. Assay description: G-402 cells expressing CYP11 constructs were established as described above and maintained in McCoy's 5a Medium Modified, ATCC Catalog No. 30-2007 co...
In DepthDetails US Patent
TargetCytochrome P450 11B2, mitochondrial(Homo sapiens (Human))
Hoffmann-La Roche
US Patent
LigandPNGBDBM101376(US9695151, 42)
Affinity DataEC50:  12nMT: 2°C. Assay description: G-402 cells expressing CYP11 constructs were established as described above and maintained in McCoy's 5a Medium Modified, ATCC Catalog No. 30-2007 co...
In DepthDetails US Patent