BDBM101464 US8524710, 42
SMILES Fc1ccc(c(Cl)c1)S(=O)(=O)[C@H]1CCN(C1)c1cc(nc(n1)C#N)C(F)(F)F
InChI Key InChIKey=VKJSNDYSRALBCT-JTQLQIEISA-N
Data  1 IC50
  Tab Delimited (TSV)   2D SDfile   Computed 3D by Vconf -m prep SDfile
Find this compound or compounds like it in BindingDB:
Activity Spreadsheet -- Enzyme Inhibition Constant Data from BindingDB
Found 1 hit for monomerid = 101464
TargetCathepsin S(Homo sapiens (Human))
Hoffmann-La Roche
US Patent
LigandPNGBDBM101464(US8524710, 42)
Affinity DataIC50:  0.335nM. Assay description: Enzyme activity is measured by observing the increase in fluorescence intensity caused by cleavage of a peptide substrate containing a fluorophore wh...
In DepthDetails US Patent