BDBM101488 US8524710, 66::US8530652, 15::US8530652, 59
SMILES CN(C)c1nc(Cl)nc(Nc2[nH]nc3c2CN(C(=O)NC2CC2c2ccccc2)C3(C)C)n1
InChI Key InChIKey=MNWLRVMLIKUAOK-UHFFFAOYSA-N
Data  1 KI  1 EC50
  Tab Delimited (TSV)   2D SDfile   Computed 3D by Vconf -m prep SDfile
Find this compound or compounds like it in BindingDB:
Activity Spreadsheet -- Enzyme Inhibition Constant Data from BindingDB
Found 1 hit for monomerid = 101488
TargetSerine/threonine-protein kinase PAK 4(Homo sapiens (Human))
Agouron Pharmaceuticals
US Patent
LigandPNGBDBM101488(US8524710, 66 | US8530652, 15 | US8530652, 59)
Affinity DataKi:  90nM EC50:  500nM. Assay description: The enzymatic activity of PAK4 KD was measured by its ability to catalyzed the transfer of a phosphate residue from a nucleoside triphosphate to an a...
In DepthDetails US Patent