BDBM10174 (2S)-N-[(5R)-5-[(4-aminobenzene)(2-methylpropyl)sulfonamido]-6-hydroxyhexyl]-2-[(2-hydroxyphenyl)formamido]-3,3-diphenylpropanamide::lysine sulfonamide analogue 35
SMILES CC(C)CN(C(CO)CCCCNC(=O)[C@@H](NC(=O)c1ccccc1O)C(c1ccccc1)c1ccccc1)S(=O)(=O)c1ccc(N)cc1
InChI Key InChIKey=YGJUYOVHWPLBES-TVQXPHSOSA-N
Data  1 KI  1 IC50
  Tab Delimited (TSV)   2D SDfile   Computed 3D by Vconf -m prep SDfile
Find this compound or compounds like it in BindingDB:
Activity Spreadsheet -- Enzyme Inhibition Constant Data from BindingDB
Found 1 hit for monomerid = 10174
TargetDimer of Gag-Pol polyprotein [501-599](Human immunodeficiency virus type 1)
Ambrilia Biopharma
LigandPNGBDBM10174((2S)-N-[(5R)-5-[(4-aminobenzene)(2-methylpropyl)su...)
Affinity DataKi:  0.580nM IC50:  0.630nM. Assay description: HIV-1 protease activity was measured by a continuous fluorometric assay. The proteolytic activity can be monitored by the increase in fluorescence in...
In DepthDetails ArticlePubMed