BDBM101923 US8530460, 1.3
SMILES CC(NC(C)=O)c1ccc(OC2CN(C2)c2ccc(OC3CC3)cc2)cc1
InChI Key InChIKey=GOVXBLMYKAUGOI-UHFFFAOYSA-N
Data  1 IC50
  Tab Delimited (TSV)   2D SDfile   Computed 3D by Vconf -m prep SDfile
Find this compound or compounds like it in BindingDB:
Activity Spreadsheet -- Enzyme Inhibition Constant Data from BindingDB
Found 1 hit for monomerid = 101923
TargetIsoform 3 of Acetyl-CoA carboxylase 2 (ACC2.v2)(Homo sapiens (Human))
Boehringer Ingelheim International
US Patent
LigandPNGBDBM101923(US8530460, 1.3)
Affinity DataIC50:  530nM. Assay description: Enzyme assay using human acetyl-CoA carboxylase 2 (ACC).
In DepthDetails US Patent