BDBM101925 US8530460, 1.5
SMILES CCOc1ccc(cc1)N1CC(C1)Oc1ccc(cc1)C(C)NC(C)=O
InChI Key InChIKey=PYMIBEHOGAKRBK-UHFFFAOYSA-N
Data  1 IC50
  Tab Delimited (TSV)   2D SDfile   Computed 3D by Vconf -m prep SDfile
Find this compound or compounds like it in BindingDB:
Activity Spreadsheet -- Enzyme Inhibition Constant Data from BindingDB
Found 1 hit for monomerid = 101925
TargetIsoform 3 of Acetyl-CoA carboxylase 2 (ACC2.v2)(Homo sapiens (Human))
Boehringer Ingelheim International
US Patent
LigandPNGBDBM101925(US8530460, 1.5)
Affinity DataIC50:  200nM. Assay description: Enzyme assay using human acetyl-CoA carboxylase 2 (ACC).
In DepthDetails US Patent