BDBM101931 US8530460, 1.11
SMILES CC(Cc1ccc(OC2CN(C2)c2ccc(cc2)C(C)(C)C)cc1)NC(C)=O
InChI Key InChIKey=YBFGPFLYUGTUKD-UHFFFAOYSA-N
Data  1 IC50
  Tab Delimited (TSV)   2D SDfile   Computed 3D by Vconf -m prep SDfile
Find this compound or compounds like it in BindingDB:
Activity Spreadsheet -- Enzyme Inhibition Constant Data from BindingDB
Found 1 hit for monomerid = 101931
TargetIsoform 3 of Acetyl-CoA carboxylase 2 (ACC2.v2)(Homo sapiens (Human))
Boehringer Ingelheim International
US Patent
LigandPNGBDBM101931(US8530460, 1.11)
Affinity DataIC50:  2.21E+3nM. Assay description: Enzyme assay using human acetyl-CoA carboxylase 2 (ACC).
In DepthDetails US Patent