BDBM102057 US8530460, 6.3
SMILES CC(NC(C)=O)c1ccc(OC2CN(C2)c2ncc(cn2)C2CC2)cc1
InChI Key InChIKey=HSKGCCXWEWJRRQ-UHFFFAOYSA-N
Data  1 IC50
  Tab Delimited (TSV)   2D SDfile   Computed 3D by Vconf -m prep SDfile
Find this compound or compounds like it in BindingDB:
Activity Spreadsheet -- Enzyme Inhibition Constant Data from BindingDB
Found 1 hit for monomerid = 102057
TargetIsoform 3 of Acetyl-CoA carboxylase 2 (ACC2.v2)(Homo sapiens (Human))
Boehringer Ingelheim International
US Patent
LigandPNGBDBM102057(US8530460, 6.3)
Affinity DataIC50:  150nM. Assay description: Enzyme assay using human acetyl-CoA carboxylase 2 (ACC).
In DepthDetails US Patent