BDBM102135 US8530648, 32
SMILES O=C1N(Cc2cccc(c2)-c2cccnc2)CCCC11CCN(CC1)c1cnc2ccccc2n1
InChI Key InChIKey=CWYFTFBSOGXBMH-UHFFFAOYSA-N
Data  2 KI  2 Kd
  Tab Delimited (TSV)   2D SDfile   Computed 3D by Vconf -m prep SDfile
Find this compound or compounds like it in BindingDB:
Activity Spreadsheet -- Enzyme Inhibition Constant Data from BindingDB
Found 4 hits for monomerid = 102135
TargetOrexin receptor type 2(Homo sapiens (Human))
Novartis
US Patent
LigandPNGBDBM102135(US8530648, 32)
Affinity DataKi:  22nMpH: 7.4Assay Description:FLIPR assay using orexin receptor.
In DepthDetails US Patent
TargetOrexin/Hypocretin receptor type 1(Homo sapiens (Human))
Novartis
US Patent
LigandPNGBDBM102135(US8530648, 32)
Affinity DataKi:  83nMpH: 7.4Assay Description:FLIPR assay using orexin receptor.
In DepthDetails US Patent
TargetOrexin receptor type 2(Homo sapiens (Human))
Novartis
US Patent
LigandPNGBDBM102135(US8530648, 32)
Affinity DataKd:  98nMpH: 7.5Assay Description:Radioligand binding assay using orexin receptor.
In DepthDetails US Patent
TargetOrexin/Hypocretin receptor type 1(Homo sapiens (Human))
Novartis
US Patent
LigandPNGBDBM102135(US8530648, 32)
Affinity DataKd:  426nMpH: 7.5Assay Description:Radioligand binding assay using orexin receptor.
In DepthDetails US Patent