BDBM102183 US8530648, 120
SMILES O=C1N(Cc2cccc(c2)-c2ccccn2)CCCC11CCN(CC1)c1cnc2ccccc2n1
InChI Key InChIKey=SZSBNPBHAYWCJQ-UHFFFAOYSA-N
Data  2 KI  2 Kd
  Tab Delimited (TSV)   2D SDfile   Computed 3D by Vconf -m prep SDfile
Find this compound or compounds like it in BindingDB:
Activity Spreadsheet -- Enzyme Inhibition Constant Data from BindingDB
Found 4 hits for monomerid = 102183
TargetOrexin receptor type 2(Homo sapiens (Human))
Novartis
US Patent
LigandPNGBDBM102183(US8530648, 120)
Affinity DataKi:  47nMpH: 7.4Assay Description:FLIPR assay using orexin receptor.
In DepthDetails US Patent
TargetOrexin/Hypocretin receptor type 1(Homo sapiens (Human))
Novartis
US Patent
LigandPNGBDBM102183(US8530648, 120)
Affinity DataKi:  420nMpH: 7.4Assay Description:FLIPR assay using orexin receptor.
In DepthDetails US Patent
TargetOrexin receptor type 2(Homo sapiens (Human))
Novartis
US Patent
LigandPNGBDBM102183(US8530648, 120)
Affinity DataKd:  175nMpH: 7.5Assay Description:Radioligand binding assay using orexin receptor.
In DepthDetails US Patent
TargetOrexin/Hypocretin receptor type 1(Homo sapiens (Human))
Novartis
US Patent
LigandPNGBDBM102183(US8530648, 120)
Affinity DataKd:  634nMpH: 7.5Assay Description:Radioligand binding assay using orexin receptor.
In DepthDetails US Patent