BDBM102236 US8530648, 173
SMILES CNc1c(CN2CCCC3(CCN(CC3)c3cnc4ccccc4n3)C2=O)cccc1C=N
InChI Key InChIKey=MKRCEDDPNCCGEE-UHFFFAOYSA-N
Data  2 KI
  Tab Delimited (TSV)   2D SDfile   Computed 3D by Vconf -m prep SDfile
Find this compound or compounds like it in BindingDB:
Activity Spreadsheet -- Enzyme Inhibition Constant Data from BindingDB
Found 2 hits for monomerid = 102236
TargetOrexin receptor type 2(Homo sapiens (Human))
Novartis
US Patent
LigandPNGBDBM102236(US8530648, 173)
Affinity DataKi:  115nMpH: 7.4Assay Description:FLIPR assay using orexin receptor.
In DepthDetails US Patent
TargetOrexin/Hypocretin receptor type 1(Homo sapiens (Human))
Novartis
US Patent
LigandPNGBDBM102236(US8530648, 173)
Affinity DataKi:  728nMpH: 7.4Assay Description:FLIPR assay using orexin receptor.
In DepthDetails US Patent