BDBM102451 US8536165, 14
SMILES OC(=O)c1cc(ccc1Nc1cnc(nc1)-c1ccccc1C1CC1)C1CC1
InChI Key InChIKey=UFZMOOJDLXYQNJ-UHFFFAOYSA-N
Data  1 IC50
  Tab Delimited (TSV)   2D SDfile   Computed 3D by Vconf -m prep SDfile
Find this compound or compounds like it in BindingDB:
Activity Spreadsheet -- Enzyme Inhibition Constant Data from BindingDB
Found 1 hit for monomerid = 102451
TargetDihydroorotate dehydrogenase (quinone), mitochondrial(Homo sapiens (Human))
Almirall
US Patent
LigandPNGBDBM102451(US8536165, 14)
Affinity DataIC50:  57nMpH: 8.0Assay Description:Inhibition of human DHODH activity assay: DHODH activity and its inhibition were studied using a chromogen reduction assay with DCIP (2,6-dichloroph...
In DepthDetails US Patent