BDBM102470 US8536165, 64
SMILES Cc1ccc(Nc2cnc(c(C)c2)-c2ccccc2Cl)c(c1)C(O)=O
InChI Key InChIKey=PLXBQFPFJPXSLH-UHFFFAOYSA-N
Data  1 IC50
  Tab Delimited (TSV)   2D SDfile   Computed 3D by Vconf -m prep SDfile
Find this compound or compounds like it in BindingDB:
Activity Spreadsheet -- Enzyme Inhibition Constant Data from BindingDB
Found 1 hit for monomerid = 102470
TargetDihydroorotate dehydrogenase (quinone), mitochondrial(Homo sapiens (Human))
Almirall
US Patent
LigandPNGBDBM102470(US8536165, 64)
Affinity DataIC50:  14nMpH: 8.0Assay Description:Inhibition of human DHODH activity assay: DHODH activity and its inhibition were studied using a chromogen reduction assay with DCIP (2,6-dichloroph...
In DepthDetails US Patent