BDBM102512 US8536175, 31
SMILES COc1cc(OC)c(Cl)c(c1Cl)-c1ccc(C(=O)Nc2ccc(CN3CCN(C)CC3)cn2)c2nccnc12
InChI Key InChIKey=ZSKIUSPECDZDLN-UHFFFAOYSA-N
Data  2 IC50
  Tab Delimited (TSV)   2D SDfile   Computed 3D by Vconf -m prep SDfile
Find this compound or compounds like it in BindingDB:
Activity Spreadsheet -- Enzyme Inhibition Constant Data from BindingDB
Found 2 hits for monomerid = 102512
TargetFibroblast growth factor receptor 3(Homo sapiens (Human))
Novartis
US Patent
LigandPNGBDBM102512(US8536175, 31)
Affinity DataIC50:  22nMT: 2°C. Assay description: The assay has been run at room temperature on a liquid handling robot. To the assay plates containing 50 mL compound or control solutions, 4.5 uL of ...
In DepthDetails US Patent
TargetFibroblast growth factor receptor 3(Homo sapiens (Human))
Novartis
US Patent
LigandPNGBDBM102512(US8536175, 31)
Affinity DataIC50:  22nM. Assay description: Protein kinase activity measured by the microfluidic caliper method.
In DepthDetails US Patent