BDBM103262 US8546389, 136
SMILES CCN(c1cc2nn(c(C(=O)NC)c2cc1C1CC1)-c1ccc(Oc2ccc(F)cc2)nc1)S(C)(=O)=O
InChI Key InChIKey=DTNILBMMHPGHBT-UHFFFAOYSA-N
Data  2 IC50
  Tab Delimited (TSV)   2D SDfile   Computed 3D by Vconf -m prep SDfile
Find this compound or compounds like it in BindingDB:
Activity Spreadsheet -- Enzyme Inhibition Constant Data from BindingDB
Found 2 hits for monomerid = 103262
TargetGenome polyprotein(Hepatitis C virus genotype 3a (isolate NZL1) (HCV))
Biota Scientific Management
US Patent
LigandPNGBDBM103262(US8546389, 136)
Affinity DataIC50:  820nM. Assay description: HCV polymerase inhibition assay: HCV polymerase reactions were carried out using a modified mothod of Howe et al., Antimicrobial Agents and Chemothe...
In DepthDetails US Patent
TargetGenome polyprotein(Hepatitis C virus genotype 1b (isolate BK) (HCV))
Biota Scientific Management
US Patent
LigandPNGBDBM103262(US8546389, 136)
Affinity DataIC50:  1.55E+3nM. Assay description: HCV polymerase inhibition assay: HCV polymerase reactions were carried out using a modified mothod of Howe et al., Antimicrobial Agents and Chemothe...
In DepthDetails US Patent