BDBM103365 US8552202, Compound 14
SMILES Cl[C@@H]1CN([C@H]2[C@@H]1OCC2=O)C(=O)[C@@H](NC(=O)c1cccc(c1)-n1ccnc1)C1CCCCC1
InChI Key InChIKey=JPQIXMPQVCDFBY-FVTFTPSCSA-N
Data  5 KI
  Tab Delimited (TSV)   2D SDfile   Computed 3D by Vconf -m prep SDfile
Find this compound or compounds like it in BindingDB:
Activity Spreadsheet -- Enzyme Inhibition Constant Data from BindingDB
Found 5 hits for monomerid = 103365
TargetCathepsin S(Homo sapiens (Human))
Amura Therapeutics
US Patent
LigandPNGBDBM103365(US8552202, Compound 14)
Affinity DataKi:  32nM. Assay description: In vitro inhibition assay using cathepsin.
In DepthDetails US Patent
TargetCathepsin K(Homo sapiens (Human))
Amura Therapeutics
US Patent
LigandPNGBDBM103365(US8552202, Compound 14)
Affinity DataKi:  230nM. Assay description: In vitro inhibition assay using cathepsin.
In DepthDetails US Patent
TargetCathepsin L2(Homo sapiens (Human))
Amura Therapeutics
US Patent
LigandPNGBDBM103365(US8552202, Compound 14)
Affinity DataKi:  1.80E+3nM. Assay description: In vitro inhibition assay using cathepsin.
In DepthDetails US Patent
TargetProcathepsin L(Homo sapiens (Human))
Amura Therapeutics
US Patent
LigandPNGBDBM103365(US8552202, Compound 14)
Affinity DataKi:  1.90E+3nM. Assay description: In vitro inhibition assay using cathepsin.
In DepthDetails US Patent
TargetCathepsin B(Homo sapiens (Human))
Amura Therapeutics
US Patent
LigandPNGBDBM103365(US8552202, Compound 14)
Affinity DataKi:  5.00E+3nM. Assay description: In vitro inhibition assay using cathepsin.
In DepthDetails US Patent