BDBM103366 US8552202, Compound 15
SMILES C[C@H]1CC[C@@H](CC1)[C@H](NC(=O)c1cccc(c1)-n1ccnc1)C(=O)N1C[C@H](F)[C@H]2OCC(=O)[C@@H]12
InChI Key InChIKey=GXCSFFZWKWHFDR-YKHRXLODSA-N
Data  5 KI
  Tab Delimited (TSV)   2D SDfile   Computed 3D by Vconf -m prep SDfile
Find this compound or compounds like it in BindingDB:
Activity Spreadsheet -- Enzyme Inhibition Constant Data from BindingDB
Found 5 hits for monomerid = 103366
TargetCathepsin S(Homo sapiens (Human))
Amura Therapeutics
US Patent
LigandPNGBDBM103366(US8552202, Compound 15)
Affinity DataKi:  15nM. Assay description: In vitro inhibition assay using cathepsin.
Ligand InfoPC cidPC sid
In DepthDetails US Patent
TargetCathepsin L2(Homo sapiens (Human))
Amura Therapeutics
US Patent
LigandPNGBDBM103366(US8552202, Compound 15)
Affinity DataKi: >1.00E+4nM. Assay description: In vitro inhibition assay using cathepsin.
Ligand InfoPC cidPC sid
In DepthDetails US Patent
TargetCathepsin B(Homo sapiens (Human))
Amura Therapeutics
US Patent
LigandPNGBDBM103366(US8552202, Compound 15)
Affinity DataKi: >1.00E+4nM. Assay description: In vitro inhibition assay using cathepsin.
Ligand InfoPC cidPC sid
In DepthDetails US Patent
TargetCathepsin K(Homo sapiens (Human))
Amura Therapeutics
US Patent
LigandPNGBDBM103366(US8552202, Compound 15)
Affinity DataKi: >1.00E+4nM. Assay description: In vitro inhibition assay using cathepsin.
Ligand InfoPC cidPC sid
In DepthDetails US Patent
TargetProcathepsin L(Homo sapiens (Human))
Amura Therapeutics
US Patent
LigandPNGBDBM103366(US8552202, Compound 15)
Affinity DataKi: >1.00E+4nM. Assay description: In vitro inhibition assay using cathepsin.
Ligand InfoPC cidPC sid
In DepthDetails US Patent