BDBM103458 US8551989, 3
SMILES CC1=NC(C)=C(C#N)C(C1C#N)c1ccc2[nH]nc(c2c1)S(C)(=O)=O
InChI Key InChIKey=RAUATPXDWZQJTH-UHFFFAOYSA-N
Data  2 IC50
  Tab Delimited (TSV)   2D SDfile   Computed 3D by Vconf -m prep SDfile
Find this compound or compounds like it in BindingDB:
Activity Spreadsheet -- Enzyme Inhibition Constant Data from BindingDB
Found 2 hits for monomerid = 103458
TargetHepatocyte growth factor receptor(Homo sapiens (Human))
Bayer Intellectual Property
US Patent
LigandPNGBDBM103458(US8551989, 3)
Affinity DataIC50:  130nMpH: 7.5 T: 2°C. Assay description: Homogeneous time-resolved fluorescence assay using c-Met receptor tyrosine kinase.
In DepthDetails US Patent
TargetHepatocyte growth factor receptor(Homo sapiens (Human))
Bayer Intellectual Property
US Patent
LigandPNGBDBM103458(US8551989, 3)
Affinity DataIC50:  77nMpH: 7.0 T: 2°C. Assay description: Tyrosine kinase activity assay (NADH Read-Out) using c-Met receptor.
In DepthDetails US Patent