BDBM103529 US8546370, 637
SMILES CCN1CCN(CCc2ccc(Nc3nc(cc4cc[nH]c(=O)c34)-c3cncc(OC)n3)cc2)CC1
InChI Key InChIKey=JRDKAIPAWULAOW-UHFFFAOYSA-N
Data  1 IC50
  Tab Delimited (TSV)   2D SDfile   Computed 3D by Vconf -m prep SDfile
Find this compound or compounds like it in BindingDB:
Activity Spreadsheet -- Enzyme Inhibition Constant Data from BindingDB
Found 1 hit for monomerid = 103529
TargetTyrosine-protein kinase ZAP-70(Homo sapiens (Human))
Irm
US Patent
LigandPNGBDBM103529(US8546370, 637)
Affinity DataIC50:  46nM. Assay description: Homogenous time-resolved fluorescence assay using Syk enzyme.
Ligand InfoPC cidPC sid
In DepthDetails US Patent