BDBM103547 US10201527, Compound 27::US10736881, Compound 27::US8551988, 27
SMILES ONC(=O)\C=C\c1ccc2n(CCc3cccnc3)c(CCc3ccccc3)nc2c1
InChI Key InChIKey=QAAVMDJOBPIAGN-JLHYYAGUSA-N
Data  6 IC50
  Tab Delimited (TSV)   2D SDfile   Computed 3D by Vconf -m prep SDfile
Find this compound or compounds like it in BindingDB:
Activity Spreadsheet -- Enzyme Inhibition Constant Data from BindingDB
Found 6 hits for monomerid = 103547
TargetHistone deacetylase 8(Homo sapiens (Human))
Mei Pharma
US Patent
LigandPNGBDBM103547(US10201527, Compound 27 | US10736881, Compound 27 ...)
Affinity DataIC50:  329nM. Assay description: The assay have been carried out in a 96 well format and the BIOMOL using a fluorescent-based HDAC activity assay.
In DepthDetails US Patent
TargetHistone deacetylase 1(Homo sapiens (Human))
Mei Pharma
US Patent
LigandPNGBDBM103547(US10201527, Compound 27 | US10736881, Compound 27 ...)
Affinity DataIC50:  92nM. Assay description: The assay have been carried out in a 96 well format and the BIOMOL using a fluorescent-based HDAC activity assay.
In DepthDetails US Patent
TargetHistone deacetylase 8(Homo sapiens (Human))
Mei Pharma
US Patent
LigandPNGBDBM103547(US10201527, Compound 27 | US10736881, Compound 27 ...)
Affinity DataIC50:  329nM
In DepthDetails US Patent
TargetHistone deacetylase 8(Homo sapiens (Human))
Mei Pharma
US Patent
LigandPNGBDBM103547(US10201527, Compound 27 | US10736881, Compound 27 ...)
Affinity DataIC50:  329nM. Assay description: To determine EC50 where acetylated histone 3 was induced by 50%, Colo205 cells was cultivated in 96 well plate at 1.5×105 cells/well for 24 h. Colo20...
In DepthDetails US Patent
TargetHistone deacetylase 1(Homo sapiens (Human))
Mei Pharma
US Patent
LigandPNGBDBM103547(US10201527, Compound 27 | US10736881, Compound 27 ...)
Affinity DataIC50:  92nM. Assay description: The assay has been carried out in 96 well format and the BIOMOL fluorescent-based HDAC activity assay has been applied. The reaction composed of assa...
In DepthDetails US Patent
TargetHistone deacetylase 1(Homo sapiens (Human))
Mei Pharma
US Patent
LigandPNGBDBM103547(US10201527, Compound 27 | US10736881, Compound 27 ...)
Affinity DataIC50:  92nM. Assay description: The assay has been carried out in 96 well format and the BIOMOL fluorescent-based HDAC activity assay has been applied. The reaction composed of assa...
In DepthDetails US Patent