BDBM103592 US10201527, Compound 86::US10736881, Compound 86::US8551988, 86
SMILES CN(C)CC(C)(C)Cn1c(CCc2cccnc2)nc2cc(\C=C\C(=O)NO)ccc12
InChI Key InChIKey=JLUMKZIBLPWZLU-FMIVXFBMSA-N
Data  3 IC50
  Tab Delimited (TSV)   2D SDfile   Computed 3D by Vconf -m prep SDfile
Find this compound or compounds like it in BindingDB:
Activity Spreadsheet -- Enzyme Inhibition Constant Data from BindingDB
Found 3 hits for monomerid = 103592
TargetHistone deacetylase 1(Homo sapiens (Human))
Mei Pharma
US Patent
LigandPNGBDBM103592(US10201527, Compound 86 | US10736881, Compound 86 ...)
Affinity DataIC50:  400nM. Assay description: The assay have been carried out in a 96 well format and the BIOMOL using a fluorescent-based HDAC activity assay.
In DepthDetails US Patent
TargetHistone deacetylase 1(Homo sapiens (Human))
Mei Pharma
US Patent
LigandPNGBDBM103592(US10201527, Compound 86 | US10736881, Compound 86 ...)
Affinity DataIC50:  400nM. Assay description: The assay has been carried out in 96 well format and the BIOMOL fluorescent-based HDAC activity assay has been applied. The reaction composed of assa...
In DepthDetails US Patent
TargetHistone deacetylase 1(Homo sapiens (Human))
Mei Pharma
US Patent
LigandPNGBDBM103592(US10201527, Compound 86 | US10736881, Compound 86 ...)
Affinity DataIC50:  400nM. Assay description: The assay has been carried out in 96 well format and the BIOMOL fluorescent-based HDAC activity assay has been applied. The reaction composed of assa...
In DepthDetails US Patent