BDBM103598 US10201527, Compound 92::US10736881, Compound 92::US8551988, 92
SMILES CCn1c(Cc2ccccc2)nc2cc(\C=C\C(=O)NO)ccc12
InChI Key InChIKey=VUKSUGCDIZBKDT-PKNBQFBNSA-N
Data  3 IC50
  Tab Delimited (TSV)   2D SDfile   Computed 3D by Vconf -m prep SDfile
Find this compound or compounds like it in BindingDB:
Activity Spreadsheet -- Enzyme Inhibition Constant Data from BindingDB
Found 3 hits for monomerid = 103598
TargetHistone deacetylase 1(Homo sapiens (Human))
Mei Pharma
US Patent
LigandPNGBDBM103598(US10201527, Compound 92 | US10736881, Compound 92 ...)
Affinity DataIC50:  168nM. Assay description: The assay have been carried out in a 96 well format and the BIOMOL using a fluorescent-based HDAC activity assay.
In DepthDetails US Patent
TargetHistone deacetylase 1(Homo sapiens (Human))
Mei Pharma
US Patent
LigandPNGBDBM103598(US10201527, Compound 92 | US10736881, Compound 92 ...)
Affinity DataIC50:  168nM. Assay description: The assay has been carried out in 96 well format and the BIOMOL fluorescent-based HDAC activity assay has been applied. The reaction composed of assa...
In DepthDetails US Patent
TargetHistone deacetylase 1(Homo sapiens (Human))
Mei Pharma
US Patent
LigandPNGBDBM103598(US10201527, Compound 92 | US10736881, Compound 92 ...)
Affinity DataIC50:  168nM. Assay description: The assay has been carried out in 96 well format and the BIOMOL fluorescent-based HDAC activity assay has been applied. The reaction composed of assa...
In DepthDetails US Patent