BDBM103969 Monosubstituted aryl-Me ATX inhibitor 7
SMILES CN1CCN(CC1)C1=NC(=O)\C(S1)=C\c1ccc(I)cc1
InChI Key InChIKey=XIEDMKGLEITHRK-RAXLEYEMSA-N
Data  1 IC50
  Tab Delimited (TSV)   2D SDfile   Computed 3D by Vconf -m prep SDfile
Find this compound or compounds like it in BindingDB:
Activity Spreadsheet -- Enzyme Inhibition Constant Data from BindingDB
Found 1 hit for monomerid = 103969
TargetEctonucleotide pyrophosphatase/phosphodiesterase family member 2(Mus musculus)
The University Of Tokyo
LigandPNGBDBM103969(Monosubstituted aryl-Me ATX inhibitor 7)
Affinity DataIC50:  170nM. Assay description: Inhibitory activities of hit compounds towards ENPP1-5 were calculated using pNP-TMP, and the inhibitory activities of hit compounds towards ENPP6 an...
In DepthDetails ArticlePubMed