BDBM103980 Disubstituted aryl-Me ATX inhibitor 8
SMILES CN1CCN(CC1)C1=NC(=O)\C(S1)=C\c1cc(cc(c1)C(C)(C)C)C(C)(C)C
InChI Key InChIKey=UWWASVHVWAWYRH-RGEXLXHISA-N
Data  1 IC50
  Tab Delimited (TSV)   2D SDfile   Computed 3D by Vconf -m prep SDfile
Find this compound or compounds like it in BindingDB:
Activity Spreadsheet -- Enzyme Inhibition Constant Data from BindingDB
Found 1 hit for monomerid = 103980
TargetEctonucleotide pyrophosphatase/phosphodiesterase family member 2(Mus musculus)
The University Of Tokyo
LigandPNGBDBM103980(Disubstituted aryl-Me ATX inhibitor 8)
Affinity DataIC50:  45nM. Assay description: Inhibitory activities of hit compounds towards ENPP1-5 were calculated using pNP-TMP, and the inhibitory activities of hit compounds towards ENPP6 an...
In DepthDetails ArticlePubMed