BDBM104013 Vibriobactin
SMILES C[C@H]1OC(=NC1C(=O)CCCCN(CCCNC(=O)c1cccc(O)c1O)C(=O)[C@H]1N=C(O[C@@H]1C)c1cccc(O)c1O)c1cccc(O)c1O
InChI Key InChIKey=IITCHWQSVXZTOJ-VJMXMHLISA-N
Data  1 Kd
  Tab Delimited (TSV)   2D SDfile   Computed 3D by Vconf -m prep SDfile
Find this compound or compounds like it in BindingDB:
Activity Spreadsheet -- Enzyme Inhibition Constant Data from BindingDB
Found 1 hit for monomerid = 104013
TargetNeutrophil gelatinase-associated lipocalin(Homo sapiens (Human))
University Of California
LigandPNGBDBM104013(Vibriobactin)
Affinity DataKd:  56nMpH: 7.4Assay Description:The ligand solutions (10uM siderophore, TBS with 5% (v/v) DMSO, pH 7.4) were prepared from 4mM stock solution in DMSO. The protein solution was pre...
In DepthDetails ArticlePubMed