BDBM104078 (Z)-5-(3-Fluoro-4-(p-tolylthio)benzylidene)-2-thioxothiazolidin-4-one 12::DNA polymerase inhibitor 12
SMILES Cc1ccc(Sc2ccc(C=C3SC(S)=NC3=O)cc2F)cc1
InChI Key InChIKey=DKWRPEYYWJRYQH-UHFFFAOYSA-N
Data  2 IC50
  Tab Delimited (TSV)   2D SDfile   Computed 3D by Vconf -m prep SDfile
Find this compound or compounds like it in BindingDB:
Activity Spreadsheet -- Enzyme Inhibition Constant Data from BindingDB
Found 2 hits for monomerid = 104078
TargetDNA polymerase lambda(Homo sapiens (Human))
University Of Konstanz
LigandPNGBDBM104078((Z)-5-(3-Fluoro-4-(p-tolylthio)benzylidene)-2-thio...)
Affinity DataIC50: <1.00E+4nMpH: 7.5Assay Description:Pol λ reactions were made in a final volume of 20uL containing 50mM Tris-HCl pH 7.5, 1.5mM MgCl2, 5% (v/v) glycerol, 1mM DTT, 250nM purified rec...
In DepthDetails ArticlePubMed
TargetDNA polymerase beta(Homo sapiens (Human))
University Of Konstanz
LigandPNGBDBM104078((Z)-5-(3-Fluoro-4-(p-tolylthio)benzylidene)-2-thio...)
Affinity DataIC50:  3.87E+4nMpH: 7.9Assay Description:Pol β reactions were made in a final volume of 20uL containing 50mM Tris-HCl pH 7.9, 20mM KCl, 5% (v/v) glycerol, 1mM DTT, 2mM MnCl2, 250nM puri...
In DepthDetails ArticlePubMed