BDBM104212 US10047086, 46::US10640503, Example 46::US9695168, 46
SMILES COC(=O)N(C)c1ccc(cc1)-c1c(nc(OC[C@@H]2CCCN(C)C2)c2cncn12)-c1ccc(cc1)C#N
InChI Key InChIKey=WGVNVIWAMDRWRX-OAQYLSRUSA-N
Data  3 IC50
  Tab Delimited (TSV)   2D SDfile   Computed 3D by Vconf -m prep SDfile
Find this compound or compounds like it in BindingDB:
Activity Spreadsheet -- Enzyme Inhibition Constant Data from BindingDB
Found 3 hits for monomerid = 104212
TargetLysine-specific histone demethylase 1A [151-852](Homo sapiens (Human))
Incyte
US Patent
LigandPNGBDBM104212(US10047086, 46 | US10640503, Example 46 | US969516...)
Affinity DataIC50:  75nMpH: 7.5 T: 2°C. Assay description: LANCE LSD1/KDM1A demethylase assay¿10 uL of 1 nM LSD-1 enzyme (ENZO BML-SE544-0050) in the assay buffer (50 mM Tris, pH 7.5, 0.01% Tween-20, 25 mM Na...
In DepthDetails US Patent
TargetLysine-specific histone demethylase 1A(Homo sapiens (Human))
Incyte
US Patent
LigandPNGBDBM104212(US10047086, 46 | US10640503, Example 46 | US969516...)
Affinity DataIC50:  75nM. Assay description: LANCE LSD1/KDM1A demethylase assay-10 μL of 1 nM LSD-1 enzyme (ENZO BML-SE544-0050) in the assay buffer (50 mM Tris, pH 7.5, 0.01% Tween-20, 25 ...
In DepthDetails US Patent
TargetLysine-specific histone demethylase 1A(Homo sapiens (Human))
Incyte
US Patent
LigandPNGBDBM104212(US10047086, 46 | US10640503, Example 46 | US969516...)
Affinity DataIC50:  75nMpH: 7.5Assay Description:LANCE LSD1/KDM1A demethylase assay-10 μL of 1 nM LSD-1 enzyme (ENZO BML-SE544-0050) in the assay buffer (50 mM Tris, pH 7.5, 0.01% Tween-20, 25 ...
In DepthDetails US Patent