BDBM104237 US8575145, 114
SMILES COC1(COc2cc(F)cc3ccc(nc23)-c2nnc3ccccn23)CCCNCC1
InChI Key InChIKey=JEKGYBBSKUISTO-UHFFFAOYSA-N
Data  2 IC50
  Tab Delimited (TSV)   2D SDfile   Computed 3D by Vconf -m prep SDfile
Find this compound or compounds like it in BindingDB:
Activity Spreadsheet -- Enzyme Inhibition Constant Data from BindingDB
Found 2 hits for monomerid = 104237
TargetSerine/threonine-protein kinase pim-2(Homo sapiens (Human))
Array Biopharma
US Patent
LigandPNGBDBM104237(US8575145, 114)
Affinity DataIC50:  86nMpH: 7.4 T: 2°C. Assay description: The assay for the determination of PIM activity is based on the incorporation of [33P] ATP into PIM2tide substrate and capture of the radiolabeled pe...
In DepthDetails US Patent
TargetSerine/threonine-protein kinase pim-1(Homo sapiens (Human))
Array Biopharma
US Patent
LigandPNGBDBM104237(US8575145, 114)
Affinity DataIC50:  0.700nMpH: 7.4 T: 2°C. Assay description: The assay for the determination of PIM activity is based on the incorporation of [33P] ATP into PIM2tide substrate and capture of the radiolabeled pe...
In DepthDetails US Patent