BDBM10445 2-methyl-N-{8-[(2-methylquinolin-4-yl)amino]octyl}quinolin-4-amine dihydrochloride::Bivalent 4-Aminoquinaldine 6g
SMILES Cc1cc(NCCCCCCCCNc2cc(C)nc3ccccc23)c2ccccc2n1
InChI Key InChIKey=IFKSBBCVDFNDDD-UHFFFAOYSA-N
Data  2 IC50
  Tab Delimited (TSV)   2D SDfile   Computed 3D by Vconf -m prep SDfile
Find this compound or compounds like it in BindingDB:
Activity Spreadsheet -- Enzyme Inhibition Constant Data from BindingDB
Found 2 hits for monomerid = 10445
TargetCarboxylic ester hydrolase(Rattus norvegicus (rat))
Hong Kong University Of Science And Technology
LigandPNGBDBM10445(2-methyl-N-{8-[(2-methylquinolin-4-yl)amino]octyl}...)
Affinity DataIC50:  1.78E+3nM. Assay description: The cholinesterase assays were performed using colorimetric method reported by Ellman. Enzyme activity was determined by measuring the absorbance at...
In DepthDetails ArticlePubMed
TargetAcetylcholinesterase(Rattus norvegicus (rat))
Hong Kong University Of Science And Technology
LigandPNGBDBM10445(2-methyl-N-{8-[(2-methylquinolin-4-yl)amino]octyl}...)
Affinity DataIC50:  161nMpH: 7.4 T: 2°C. Assay description: The cholinesterase assays were performed using colorimetric method reported by Ellman. Enzyme activity was determined by measuring the absorbance at...
In DepthDetails ArticlePubMed