BDBM104949 US8575391, C-31
SMILES CS(=O)CCONCc1cc(C(=O)NOCCO)c(Nc2ccc(I)cc2F)c(F)c1F
InChI Key InChIKey=KRLVJGDCIOMJDA-UHFFFAOYSA-N
Data  1 IC50
  Tab Delimited (TSV)   2D SDfile   Computed 3D by Vconf -m prep SDfile
Find this compound or compounds like it in BindingDB:
Activity Spreadsheet -- Enzyme Inhibition Constant Data from BindingDB
Found 1 hit for monomerid = 104949
TargetDual specificity mitogen-activated protein kinase kinase 1(Homo sapiens (Human))
Chugai Seiyaku Kabushiki Kaisha
US Patent
LigandPNGBDBM104949(US8575391, C-31)
Affinity DataIC50:  12nM. Assay description: Inhibition assay using MEK kinase.
In DepthDetails US Patent